{"text_format":"3","workbook":"xlsx","n_sheets":11,"sheets":["General","Contexto","Activos","Inventario Amenazas","TABLAS","escenario de riesgo","Agentes","calificacion-Control","Aceptabilidad-Control","tratamiento","Riesgo residual"],"not_rendered":{"charts":1,"macros":1,"defined_names":3,"comments":1},"read":"whole","date_system":"1900"}

{"sheet":"General","index":0,"n_rows":5,"n_cols":4,"rows_kept":5}
["Control de versiones del documento"]
["Versión","Fecha","Creada por","Descripción"]
["1.0","Abril 10 de 2014","Héctor Vargas","Creación del documento"]
[]
[" "]

{"sheet":"Contexto","index":1,"n_rows":15,"n_cols":3,"rows_kept":15,"merged":[[0,0,0,5],[1,0,3,5],[4,0,4,5],[5,0,7,5],[10,0,10,2]]}
["Definición del contexto: Interno"]
["Análisis sobre el SGSI y su respectivo alcance"]
[]
[]
["OBJETIVO DEL ANÁLISIS DE RIESGOS"]
["Obtener los diferentes riesgos que puedan impactar al SGSI, sus alcances y objetivo."]
[]
[]
[]
[]
["Plan de comunicación"]
["Medio","Días","Frecuencia"]
["Reuniones","3 x semana","2 horas"]
["Correo","Continuo"]
["Actas",null,"acorde a las reuniones"]
{"$rows_left_out":1}
{"sheet":"Activos","index":2,"n_rows":23,"n_cols":3,"rows_kept":23,"merged":[[0,0,1,1],[0,2,1,2],[2,0,3,0],[5,0,7,0],[8,0,11,0],[13,0,14,0]]}
["ACTIVOS /RECURSOS",null,"Niveles de criticidad"]
[]
["Medio ambiente e infraestructura","Instalaciones físicas- Centro procesamiento","Alto - A"]
[null,"Equipamiento auxiliar: Aire acondicionado, potencia, ","Alto - A"]
["Personas","Empleados, contratistas, proveedores","Medio - ME"]
["Hardware","Servidores de Bases de Datos y aplicaciones (hardware)","Alto - A"]
[null,"Medios magnéticosy de almacenamiento","Alto - A"]
[null,"Computadores, Portátiles, Smartphone","Medio - ME"]
["Software","Aplicación de Bases de Datos","Medio - ME"]
[null,"Aplicaciones ERP-CRM-OSS y facturación","Alto - A"]
[null,"Aplicaciones Web","Muy alto - MA"]
[null,"Sistemas operativos","Alto - A"]
["Comunicaciones","Router, Switch, CPE","Medio - ME"]
["Documentos/datos/información","Acuerdos de Confidencialidad - contratos","Medio - ME"]
[null,"Datos","Alto - A"]
{"$rows_left_out":9}
{"sheet":"Inventario Amenazas","index":3,"n_rows":17,"n_cols":5,"rows_kept":17}
["AMENAZAS TIC","AMENAZAS NATURALES/tecnológicas","AMENAZAS HUMANAS/SOCIALES","AMENAZAS ESTRATÉGICAS Y ADMINISTRATIVAS","AMENAZAS ASOCIADAS A LOS PROYECTOS"]
["Manipulación de datos o software","Inundación","Vandalismo","Violación de derechos de autor","Brecha en la legislación"]
["Manipulación de equipo informático","rayos","Acceso no autorizado al sitio/edificio/sala","Selección de contratistas o personal no idóneo","Errores de diseño"]
["Falla/degradación de equipo informáticoo de comunicación","incendio","Robo",null,"Fraude en la selección de proveedor"]
["Uso no autorizado de software","Falla en aire acondicionado","Ingenieria social"]
["Suplantación","Fallo en suministro de energia","Error humano"]
["Acceso no autorizado a red",null,"Empleado descontento"]
["Software malicioso"]
["crakeo de contraseñas"]
["Ataque de negación de servicio"]
["Deterioro/degradación"]
["Eliminación no autorizada"]
["Hacker/cracker"]
["Cross Site Scripting - XSS"]
["SQL Injection"]
{"$rows_left_out":3}
{"sheet":"TABLAS","index":4,"n_rows":15,"n_cols":3,"rows_kept":15,"merged":[[0,0,0,2],[8,0,8,2]]}
["TABLAS DE PROBABILIDAD/FRECUENCIA"]
["Nivel","Rangos","Ejemplo detallado de la descripción"]
[1,"Raro","Puede ocurrir solo bajo circunstancias excepcionales"]
[2,"Improbable","Podría ocurrir algunas veces"]
[3,"Posible","Puede ocurrir en algún momento"]
[4,"Probable","Probabilidad de ocurrencia en la mayoría de las circunstancias"]
[5,"Casi seguro","La expectativa de ocurrencia se da en la mayoría de circunstancias"]
[]
["Impacto en la OPERACIÓN/INFORMACIÓN"]
["Nivel","Rangos","Descripción"]
[1,"Insignificante","Hay una afectación en la operación/información menor a 4 y la puede resolver la mesa de ayuda."]
[2,"Menor","Hay una afectación en la operación/información entre 4 y 12 horas, es necesario escalarlo a un segundo nivel"]
[3,"Moderado","Hay una afectación en la operación/información entre 12 y 36 horas, se requiere consulta el proveedor dueño de la plataforma. Es manejable la pérdida de información, se puede recuperar."]
[4,"Mayor","Hay una afectación en la operación/información entre 36 y 72 horas, se requiere al proveedor en sitio. Puede haber pérdida importante de información"]
[5,"Catastrofico","Hay una afectación en la operación/información por más de 72 horas, es necesario establecer un mecanismo de procesamiento alterno. Podría haber sanciones o multas"]
{"$rows_left_out":1}
{"sheet":"escenario de riesgo","index":5,"n_rows":33,"n_cols":14,"rows_kept":33}
["AMENAZAS/ACTIVOS","Instalaciones físicas- Centro procesamiento","Equipamiento auxiliar: Aire acondicionado, potencia, ","Empleados, contratistas, proveedores","Servidores de Bases de Datos y aplicaciones (hardware)","Medios magnéticosy de almacenamiento","Computadores, Portátiles, Smartphone","Aplicación de Bases de Datos","Aplicaciones ERP-CRM-OSS y facturación","Aplicaciones Web","Router, Switch, CPE","Acuerdos de Confidencialidad - contratos","Datos","Sistemas Operativos"]
["Manipulación de datos o software",{"$nulls":4},"x",null,"x","x","x","x"]
["Manipulación de equipo informático",{"$nulls":5},"x",{"$nulls":3},"x",null,"x","x"]
["Falla/degradación de equipo informático de comunicación",{"$nulls":9},"x"]
["Uso no autorizado de software",{"$nulls":6},"x",{"$nulls":5},"x"]
["Suplantación",null,null,"x",{"$nulls":5},"x",null,"x"]
["Acceso no autorizado a red",{"$nulls":9},"x"]
["Software malicioso",{"$nulls":5},"x","x",{"$nulls":5},"x"]
["crakeo de contraseñas",{"$nulls":5},"x","x","x","x","x",null,null,"x"]
["Ataque de negación de servicio",{"$nulls":6},"x","x","x","x",null,"x","x"]
["Deterioro/degradación",{"$nulls":4},"x",{"$nulls":7},"x"]
["Eliminación no autorizada",{"$nulls":4},"x",{"$nulls":6},"x"]
["Hacker/cracker",{"$nulls":6},"x",null,"x",{"$nulls":3},"x"]
["Cross Site Scripting - XSS",{"$nulls":8},"x"]
["SQL Injection",{"$nulls":6},"x",null,"x"]
{"$rows_left_out":19}
{"sheet":"Agentes","index":6,"n_rows":87,"n_cols":5,"rows_kept":87,"merged":[[0,0,0,4]]}
[]
["Escenario del riesgos","Agente Generador","Causa","Posibles Impactos generados","Controles actuales"]
["Manipulación de datos o software  --  Medios magnéticosy de almacenamiento","Empleados y contratistas con acceso","Falta de control de acceso físico/lógico, falta de procedimientos de operación","Pérdidas económicas, pérdida de información, pérdida de integridad de datos..","Control de permisos de administración local, personal autorizado para manipulación de cintas y medios, capacitación."]
["Manipulación de datos o software  --  Aplicación de Bases de Datos","Empleados y contratistas con acceso, programas (scripts), códigos maliciosos","Falencia en el control lógico, falta de procedimientos de control de acceso, falencias en el control de ejecución de script, falta de monitoreo del sistema.","Pérdidas económicas, pérdida de información, pérdida de integridad de datos, fraudes.","Definición de roles de acceso, control de acceso lógico, personal idóneo y capacitado."]
["Manipulación de datos o software  --  Aplicaciones ERP-CRM-OSS y facturación","Empleados y contratistas con acceso, programas (scripts), códigos maliciosos","Falencia en el control lógico, falta de procedimientos de control de acceso, falencias en el control de ejecución de script, falta de monitoreo del sistema. No definición adecuada de roles de acceso. Falta de gestión de la vulnerabilidad técnicas. ","Pérdidas económicas, pérdida de información, pérdida de integridad de datos, fraudes.","Definición de roles de acceso, control de acceso lógico, personal idóneo y capacitado."]
["Manipulación de datos o software  --  Aplicaciones Web","Empleados y contratistas con acceso, programas (scripts), códigos maliciosos, hackers/crackers","Falencia en el control lógico, falta de procedimientos de control de acceso, falencias en el control de ejecución de script, falta de monitoreo del sistema.No definición adecuada de roles de acceso.Falencias en el acceso remoto.","Daño a la imagen y pérdida de credibilidad, Pérdidas económicas, pérdida de información, pérdida de integridad de datos..","Definición de roles de acceso, control de acceso lógico, personal idóneo y capacitado."]
["Manipulación de datos o software  --  Router, Switch, CPE","Clientes y empleados.","Falta de seguridad dentro de la configuración del Router. Carencia de controles en las cuentas de los funcionarios que manipulan el sistema. Falta de control sobre los puertos y mantenimiento de la configuración, falencias en la aceptación de los sistemas.","Pérdida de paquetes y de disponibilidad, Pérdidas económicas, pérdida de información, pérdida de integridad de datos..","Implementación de lineamientos de seguridad técnica."]
["Manipulación de equipo informático  --  Computadores, Portátiles, Smartphone","Empleados y contratistas","Falta de conciencia en seguridad, no control de acceso lógico (permisos de administración local), falencia en los procedimientos de seguridad. Falta de una política de seguridad.","Pérdidas económicas, pérdida de información, pérdida de integridad de datos..","Asignación de personal de mesa de ayuda, control de instalación de software."]
["Manipulación de equipo informático  --  Router, Switch, CPE","Empleados y contratistas","Falta de seguridad dentro de la configuración del Router. Carencia de controles en las cuentas de los funcionarios que manipulan el sistema. Falta de control sobre los puertos y mantenimiento de la configuración ","Pérdidas económicas, pérdida de información, pérdida de integridad de datos..","Asignación de personal de mesa de ayuda, control de instalación de software."]
["Manipulación de equipo informático  --  Datos","Empleados y contratistas","Falta de conciencia en seguridad, no control de acceso lógico (permisos de administración local), falencia en los procedimientos de seguridad. Falta de una política de seguridad.Carencia de medidas de respaldos (backup)","Pérdidas económicas, pérdida de información, pérdida de integridad de datos..","Asignación de personal de mesa de ayuda, control de instalación de software."]
["Falla/degradación de equipo informático de comunicación  --  Router, Switch, CPE","Equipo de comunicación como tal","Falta de mantenimiento preventivo, Falta de seguridad dentro de la configuración del Router. Carencia de controles en las cuentas de los funcionarios y terceros que manipulan el sistema. Falta de control sobre los puertos y mantenimiento de la configuración ","Daño en el servicio, pérdida de imagen, pérdida finacieras.","Implementación de lineamientos de seguridad técnica.Contratos con los proveedores, personal idóneo."]
["Uso no autorizado de software  --  Aplicación de Bases de Datos","Empleados y contratistas","Falta de conciencia en seguridad, no control de acceso lógico (permisos sobre la BD), falencia en los procedimientos de seguridad. Falta de políticas de seguridad. ","Demandas, demoras, sanciones y daño a la imagen","Definición de roles de acceso, control de acceso lógico, personal idóneo y capacitado."]
["Suplantación  --  Empleados, contratistas, proveedores","Empleados y contratistas, hacker/cracker","Falta de control de acceso y toma de conciencia, falencias en contraseñas y mecanismos de autenticación, equipos de cómputo desprotegidos.Falta de gestión de la vulnerabilidad técnicas. ","Daño en el servicio, pérdida de imagen, pérdida finacieras.","Se cuenta con algunos planes de sensibilización, mecanismos de contraseñas fuertes."]
["Suplantación  --  Aplicaciones Web"," hacker/cracker, botnet","Falta de pruebas de seguridad, falencia en controles criptográficos, falta de control de acceso, falta de controles de autenticación.Falta de gestión de la vulnerabilidad técnicas. Falencia en manejo de incidentes de seguridad","Daño en el servicio, pérdida de imagen, pérdida finacieras.","Controles criptográficos (certificados)"]
["Acceso no autorizado a red  --  Router, Switch, CPE","Empleados y contratistas, hacker/cracker, clientes","Definición inadecuada de roles, falta de segmentación de redes, falencia en el control de acceso, falta de sistemas de autenticación (AAA),  falta de mecanismos de monitoreo, falta de aseguramiento de los dispositivos de red.Falencia en manejo de incidentes de seguridad","Daño en el servicio, pérdida de imagen, pérdida finacieras.","Algunos controles lógicos y físicos."]
{"$rows_left_out":73}
{"sheet":"calificacion-Control","index":7,"n_rows":87,"n_cols":5,"rows_kept":87,"merged":[[1,1,1,2],[1,3,1,4]]}
["Calificación de los riesgos"]
["ESCENARIO","PROBABILIDAD",null,"IMPACTO OPERACIÓN - INFORMACIÓN"]
[{"$f":"Agentes!A3","v":"Manipulación de datos o software  --  Medios magnéticosy de almacenamiento"},{"$f":"VLOOKUP(C3,TABLAS!$A$3:$B$7,2)","v":"Improbable"},2,{"$f":"VLOOKUP(E3,TABLAS!$A$11:$B$15,2)","v":"Moderado"},3]
[{"$f":"Agentes!A4","v":"Manipulación de datos o software  --  Aplicación de Bases de Datos"},{"$f":"VLOOKUP(C4,TABLAS!$A$3:$B$7,2)","v":"Posible"},3,{"$f":"VLOOKUP(E4,TABLAS!$A$11:$B$15,2)","v":"Menor"},2]
[{"$f":"Agentes!A5","v":"Manipulación de datos o software  --  Aplicaciones ERP-CRM-OSS y facturación"},{"$f":"VLOOKUP(C5,TABLAS!$A$3:$B$7,2)","v":"Posible"},3,{"$f":"VLOOKUP(E5,TABLAS!$A$11:$B$15,2)","v":"Mayor"},4]
[{"$f":"Agentes!A6","v":"Manipulación de datos o software  --  Aplicaciones Web"},{"$f":"VLOOKUP(C6,TABLAS!$A$3:$B$7,2)","v":"Posible"},3,{"$f":"VLOOKUP(E6,TABLAS!$A$11:$B$15,2)","v":"Menor"},2]
[{"$f":"Agentes!A7","v":"Manipulación de datos o software  --  Router, Switch, CPE"},{"$f":"VLOOKUP(C7,TABLAS!$A$3:$B$7,2)","v":"Posible"},3,{"$f":"VLOOKUP(E7,TABLAS!$A$11:$B$15,2)","v":"Moderado"},3]
[{"$f":"Agentes!A8","v":"Manipulación de equipo informático  --  Computadores, Portátiles, Smartphone"},{"$f":"VLOOKUP(C8,TABLAS!$A$3:$B$7,2)","v":"Posible"},3,{"$f":"VLOOKUP(E8,TABLAS!$A$11:$B$15,2)","v":"Mayor"},4]
[{"$f":"Agentes!A9","v":"Manipulación de equipo informático  --  Router, Switch, CPE"},{"$f":"VLOOKUP(C9,TABLAS!$A$3:$B$7,2)","v":"Posible"},3,{"$f":"VLOOKUP(E9,TABLAS!$A$11:$B$15,2)","v":"Mayor"},4]
[{"$f":"Agentes!A10","v":"Manipulación de equipo informático  --  Datos"},{"$f":"VLOOKUP(C10,TABLAS!$A$3:$B$7,2)","v":"Probable"},4,{"$f":"VLOOKUP(E10,TABLAS!$A$11:$B$15,2)","v":"Menor"},2]
[{"$f":"Agentes!A11","v":"Falla/degradación de equipo informático de comunicación  --  Router, Switch, CPE"},{"$f":"VLOOKUP(C11,TABLAS!$A$3:$B$7,2)","v":"Raro"},1,{"$f":"VLOOKUP(E11,TABLAS!$A$11:$B$15,2)","v":"Menor"},2]
[{"$f":"Agentes!A12","v":"Uso no autorizado de software  --  Aplicación de Bases de Datos"},{"$f":"VLOOKUP(C12,TABLAS!$A$3:$B$7,2)","v":"Improbable"},2,{"$f":"VLOOKUP(E12,TABLAS!$A$11:$B$15,2)","v":"Mayor"},4]
[{"$f":"Agentes!A13","v":"Suplantación  --  Empleados, contratistas, proveedores"},{"$f":"VLOOKUP(C13,TABLAS!$A$3:$B$7,2)","v":"Posible"},3,{"$f":"VLOOKUP(E13,TABLAS!$A$11:$B$15,2)","v":"Moderado"},3]
[{"$f":"Agentes!A14","v":"Suplantación  --  Aplicaciones Web"},{"$f":"VLOOKUP(C14,TABLAS!$A$3:$B$7,2)","v":"Probable"},4,{"$f":"VLOOKUP(E14,TABLAS!$A$11:$B$15,2)","v":"Menor"},2]
[{"$f":"Agentes!A15","v":"Acceso no autorizado a red  --  Router, Switch, CPE"},{"$f":"VLOOKUP(C15,TABLAS!$A$3:$B$7,2)","v":"Raro"},1,{"$f":"VLOOKUP(E15,TABLAS!$A$11:$B$15,2)","v":"Moderado"},3]
{"$rows_left_out":73}
{"sheet":"Aceptabilidad-Control","index":8,"n_rows":21,"n_cols":12,"rows_kept":21,"merged":[[4,0,4,6],[5,0,5,6],[5,9,5,11],[6,0,7,0],[6,1,7,1],[6,2,6,6],[15,0,15,6],[17,1,17,6],[18,1,18,6],[19,1,19,6],[20,1,20,6]]}
[]
[]
[]
[]
[]
["ACEPTABILIDAD DEL RIESGO",{"$nulls":8},"DISTRIBUCIÒN PORCENTUAL"]
["Probabilidad","valor","Impacto",{"$nulls":6},"ZONA","%","Total riesgos"]
[null,null,1,2,3,4,5,null,null,"Bajo",{"$f":"L8/85","v":{"v":0.18823529411764706,"d":"18.82%"}},16]
["Casi seguro",5,null,null,"Cross Site Scripting - XSS  --  Aplicaciones Web || SQL Injection  --  Aplicaciones Web || ",null,"Manipulación de equipo informático  --  Sistemas Operativos || ",null,null,"Moderado",{"$f":"+L9/85","v":{"v":0.35294117647058826,"d":"35.29%"}},30]
["Probable",4,"Eliminación no autorizada  --  Medios magnéticosy de almacenamiento || Interceptación de datos  --  Aplicaciones Web || ","Manipulación de equipo informático  --  Datos || Suplantación  --  Aplicaciones Web || Hacker/cracker  --  Aplicaciones Web || ","Ingenieria social  --  Empleados, contratistas, proveedores || ","crakeo de contraseñas  --  Computadores, Portátiles, Smartphone || Robo  --  Computadores, Portátiles, Smartphone || Robo  --  Router, Switch, CPE || Uso no autorizado de software  --  Sistemas Operativos || ","crakeo de contraseñas  --  Aplicaciones Web || Ataque de negación de servicio  --  Aplicaciones Web || Violación de derechos de autor  --  Sistemas Operativos || ",null,null,"Alto",{"$f":"+L10/85","v":{"v":0.2,"d":"20.00%"}},17]
["Posible",3,null,"Manipulación de datos o software  --  Aplicación de Bases de Datos || Manipulación de datos o software  --  Aplicaciones Web || Software malicioso  --  Computadores, Portátiles, Smartphone || Interceptación de datos  --  Router, Switch, CPE || Suplantacion -- Acuerdos de Confidencialidad - contratos || Hacker/cracker -- Sistemas Operativos","Manipulación de datos o software  --  Router, Switch, CPE || Suplantación  --  Empleados, contratistas, proveedores || Ataque de negación de servicio  --  Aplicación de Bases de Datos || Selección de contratistas o personal no idóneo  --  Empleados, contratistas, proveedores || Fraude en la selección de proveedor  --  Empleados, contratistas, proveedores || ","Manipulación de datos o software  --  Aplicaciones ERP-CRM-OSS y facturación || Manipulación de equipo informático  --  Computadores, Portátiles, Smartphone || Manipulación de equipo informático  --  Router, Switch, CPE || SQL Injection  --  Aplicación de Bases de Datos || Acceso no autorizado al sitio/edificio/sala  --  Instalaciones físicas- Centro procesamiento || Error humano  --  Empleados, contratistas, proveedores || Selección de contratistas o personal no idóneo  --  Acuerdos de Confidencialidad - contratos || Copias de seguridad incompletas  --  Sistemas Operativos || ","Robo  --  Datos || Brecha en la legislación  --  Acuerdos de Confidencialidad - contratos || ",null,null,"Extremo",{"$f":"+L11/85","v":{"v":0.25882352941176473,"d":"25.88%"}},22]
["Improbable",2,"Falla en aire acondicionado  --  Servidores de Bases de Datos y aplicaciones (hardware) || ","Software malicioso  --  Aplicación de Bases de Datos || crakeo de contraseñas  --  Aplicaciones ERP-CRM-OSS y facturación || Deterioro/degradación  --  Medios magnéticosy de almacenamiento || Hacker/cracker  --  Aplicación de Bases de Datos || rayos  --  Instalaciones físicas- Centro procesamiento || Falla en aire acondicionado  --  Equipamiento auxiliar: Aire acondicionado, potencia,  || Fallo en suministro de energia  --  Instalaciones físicas- Centro procesamiento || Fallo en suministro de energia  --  Equipamiento auxiliar: Aire acondicionado, potencia,  || Fraude en la selección de proveedor  --  Acuerdos de Confidencialidad - contratos || Software malicioso  --  Sistemas Operativos || ","Manipulación de datos o software  --  Medios magnéticosy de almacenamiento || crakeo de contraseñas  --  Aplicación de Bases de Datos || crakeo de contraseñas  --  Router, Switch, CPE || Ataque de negación de servicio  --  Router, Switch, CPE || incendio  --  Instalaciones físicas- Centro procesamiento || Fallo en suministro de energia  --  Servidores de Bases de Datos y aplicaciones (hardware) || Vandalismo  --  Instalaciones físicas- Centro procesamiento || Vandalismo  --  Equipamiento auxiliar: Aire acondicionado, potencia,  || Vandalismo  --  Empleados, contratistas, proveedores || Acceso no autorizado al sitio/edificio/sala  --  Acuerdos de Confidencialidad - contratos || Errores de diseño  --  Aplicaciones Web || crakeo de contraseñas  --  Sistemas Operativos || Deterioro/degradación -- Sistemas Operativos","Uso no autorizado de software  --  Aplicación de Bases de Datos || Eliminación no autorizada  --  Datos || Copias de seguridad incompletas  --  Datos || Error humano  --  Datos || ","rayos  --  Servidores de Bases de Datos y aplicaciones (hardware) || Violación de derechos de autor  --  Datos || "]
["Raro",1,"Violación de derechos de autor  --  Acuerdos de Confidencialidad - contratos || ","Falla/degradación de equipo informático de comunicación  --  Router, Switch, CPE || Ataque de negación de servicio  --  Aplicaciones ERP-CRM-OSS y facturación || Ataque de negación de servicio  --  Datos || Ataque de negación de servicio  --  Sistemas Operativos || ","Acceso no autorizado a red  --  Router, Switch, CPE || Inundación  --  Equipamiento auxiliar: Aire acondicionado, potencia,  || incendio  --  Equipamiento auxiliar: Aire acondicionado, potencia,  || incendio  --  Servidores de Bases de Datos y aplicaciones (hardware) || Empleado descontento  --  Instalaciones físicas- Centro procesamiento || Empleado descontento  --  Equipamiento auxiliar: Aire acondicionado, potencia,  || Violación de derechos de autor  --  Aplicación de Bases de Datos || Violación de derechos de autor  --  Aplicaciones ERP-CRM-OSS y facturación || Errores de diseño  --  Aplicaciones ERP-CRM-OSS y facturación || ","Copias de seguridad incompletas  --  Medios magnéticosy de almacenamiento || Empleado descontento  --  Computadores, Portátiles, Smartphone || Empleado descontento  --  Datos || ","Inundación  --  Instalaciones físicas- Centro procesamiento || "]
[]
[]
{"$rows_left_out":7}
{"sheet":"tratamiento","index":9,"n_rows":41,"n_cols":7,"rows_kept":41,"merged":[[0,0,1,0],[0,3,0,6]]}
["RIESGOS ALTOS \n(Naranjas y rojos)",null,null,"TRATAMIENTO"]
[null,"Nivel de \nriesgos","Criticida del activo","Asumirlo","Evitarlo","Reducir probabilidad, o\nreducir impacto","Transferirlo"]
["Manipulación de datos o software  --  Aplicaciones ERP-CRM-OSS y facturación","Extremo","Alto - A",null,null,"x"]
["Manipulación de datos o software  --  Router, Switch, CPE","Alto","Medio - ME",null,null,"x"]
["Manipulación de equipo informático  --  Computadores, Portátiles, Smartphone","Extremo","Medio - ME",null,null,"x"]
["Manipulación de equipo informático  --  Router, Switch, CPE","Extremo","Medio - ME",null,null,"x"]
["Manipulación de equipo informático  --  Datos","Alto","Alto - A",null,null,"x"]
["Uso no autorizado de software  --  Aplicación de Bases de Datos","Alto","Medio - ME",null,null,"x"]
["Suplantación  --  Empleados, contratistas, proveedores","Alto","Medio - ME",null,null,"x"]
["Suplantación  --  Aplicaciones Web","Alto","Muy alto - MA",null,null,"x"]
["crakeo de contraseñas  --  Computadores, Portátiles, Smartphone","Extremo","Medio - ME",null,null,"x"]
["crakeo de contraseñas  --  Aplicaciones Web","Extremo","Muy alto - MA",null,null,"x"]
["Ataque de negación de servicio  --  Aplicación de Bases de Datos","Alto","Medio - ME",null,null,"x"]
["Ataque de negación de servicio  --  Aplicaciones Web","Extremo","Muy alto - MA",null,null,"x"]
["Eliminación no autorizada  --  Datos","Alto","Alto - A",null,null,"x"]
{"$rows_left_out":27}
{"sheet":"Riesgo residual","index":10,"n_rows":47,"n_cols":3,"rows_kept":47}
["Riesgos Aceptados",null,"Riesgos residuales (después de implementar controles)"]
["Eliminación no autorizada  --  Medios magnéticosy de almacenamiento "]
["Interceptación de datos  --  Aplicaciones Web"]
["Falla en aire acondicionado  --  Servidores de Bases de Datos y aplicaciones (hardware) "]
["Violación de derechos de autor  --  Acuerdos de Confidencialidad - contratos"]
["Manipulación de datos o software  --  Aplicación de Bases de Datos"]
["Manipulación de datos o software  --  Aplicaciones Web "]
["Software malicioso  --  Computadores, Portátiles, Smartphone "]
["Interceptación de datos  --  Router, Switch, CPE"]
["Software malicioso  --  Aplicación de Bases de Datos"]
["crakeo de contraseñas  --  Aplicaciones ERP-CRM-OSS y facturación"]
["Deterioro/degradación  --  Medios magnéticosy de almacenamiento"]
["Hacker/cracker  --  Aplicación de Bases de Datos"]
["rayos  --  Instalaciones físicas- Centro procesamiento "]
["Falla en aire acondicionado  --  Equipamiento auxiliar: Aire acondicionado, potencia"]
{"$rows_left_out":32}